{"text_format":"1","workbook":"xlsx","n_sheets":15,"sheets":["Data","Annual Summary","Charts","January","February","March","April","May","June","July","August","September","October","November","December"],"not_rendered":{"charts":33,"images":1,"macros":1,"external_links":0,"defined_names":26,"comments":0,"pivot_tables":0},"unopened":[],"bounds":{"document_bytes":16777216,"sheet_cells":100000,"rows_first":2000,"rows_last":500,"rows_between":2000,"halvings":0,"cell_chars":16384,"cell_head_chars":4096},"cells_cut":0,"cells_raw":0,"read":"whole","date_system":"1900"}

{"sheet":"Data","index":0,"n_rows":366,"n_cols":20,"rows_kept":366,"cut":false,"hidden":true,"merged":[[2,13,2,14]]}
["Date","Month","GP","Rainfall","Min Air Temp","Max Air Temp","Dry Day","Wet Day","Frost Day","Smith Kerns","E.T","Humidity",null,null,null,"day","Month","year",null,"Date"]
[{"$f":"T2","v":"2023-01-01"},{"$f":"TEXT($A2,\"mmmm\")","v":"January"},{"$f":"VLOOKUP($A2,INDIRECT($B2 & \"!$B$10:$P$40\"),9,FALSE)","v":""},{"$f":"IF($C2<>\"\",IF(VLOOKUP($A2,INDIRECT($B2 & \"!$B$10:$P$40\"),5,FALSE)<>\"\",VLOOKUP($A2,INDIRECT($B2 & \"!$B$10:$P$40\"),5,FALSE),0),\"\")","v":""},{"$f":"IF(VLOOKUP($A2,INDIRECT($B2 & \"!$B$10:$P$40\"),2,FALSE)<>\"\",VLOOKUP($A2,INDIRECT($B2 & \"!$B$10:$P$40\"),2,FALSE),\"\")","v":""},{"$f":"IF(VLOOKUP($A2,INDIRECT($B2 & \"!$B$10:$P$40\"),3,FALSE)<>\"\",VLOOKUP($A2,INDIRECT($B2 & \"!$B$10:$P$40\"),3,FALSE),\"\")","v":""},{"$f":"IF($C2<>\"\",IF($D2=0,1,0),\"\")","v":""},{"$f":"IF($G2<>\"\",IF($D2>0,1,0),\"\")","v":""},{"$f":"IF($E2<>\"\",IF($E2<=0,1,0),\"\")","v":""},{"$f":"IFERROR(IF((-11.4041+(0.0894*AVERAGE(#REF!))+(0.1932*AVERAGE(#REF!)))<>\"\",IF(OR(AVERAGE(#REF!)<=10,AVERAGE(#REF!)>=35),\"\",(EXP((-11.4041+(0.0894*AVERAGE(#REF!))+(0.1932*AVERAGE(#REF!)))))/(1+EXP((-11.4041+(0.0894*AVERAGE(#REF!))+(0.1932*AVERAGE(#REF!)))))),\"\"),\"\")","v":""},{"$f":"IF(VLOOKUP($A2,INDIRECT($B2 & \"!$B$10:$P$40\"),14,FALSE)<>\"\",VLOOKUP($A2,INDIRECT($B2 & \"!$B$10:$P$40\"),14,FALSE),\"\")","v":""},{"$f":"IF(VLOOKUP($A2,INDIRECT($B2 & \"!$B$10:$P$40\"),13,FALSE)<>\"\",VLOOKUP($A2,INDIRECT($B2 & \"!$B$10:$P$40\"),13,FALSE),\"\")","v":""},null,null,null,1,1,2023,null,{"$f":"DATE(R2,Q2,P2)","v":"2023-01-01"}]
[{"$f":"T3","v":"2023-01-02"},{"$f":"TEXT($A3,\"mmmm\")","v":"January"},{"$f":"VLOOKUP($A3,INDIRECT($B3 & \"!$B$10:$P$40\"),9,FALSE)","v":""},{"$f":"IF($C3<>\"\",IF(VLOOKUP($A3,INDIRECT($B3 & \"!$B$10:$P$40\"),5,FALSE)<>\"\",VLOOKUP($A3,INDIRECT($B3 & \"!$B$10:$P$40\"),5,FALSE),0),\"\")","v":""},{"$f":"IF(VLOOKUP($A3,INDIRECT($B3 & \"!$B$10:$P$40\"),2,FALSE)<>\"\",VLOOKUP($A3,INDIRECT($B3 & \"!$B$10:$P$40\"),2,FALSE),\"\")","v":""},{"$f":"IF(VLOOKUP($A3,INDIRECT($B3 & \"!$B$10:$P$40\"),3,FALSE)<>\"\",VLOOKUP($A3,INDIRECT($B3 & \"!$B$10:$P$40\"),3,FALSE),\"\")","v":""},{"$f":"IF($C3<>\"\",IF($D3=0,1,0),\"\")","v":""},{"$f":"IF($G3<>\"\",IF($D3>0,1,0),\"\")","v":""},{"$f":"IF($E3<>\"\",IF($E3<=0,1,0),\"\")","v":""},{"$f":"IFERROR(IF((-11.4041+(0.0894*AVERAGE(#REF!))+(0.1932*AVERAGE(#REF!)))<>\"\",IF(OR(AVERAGE(#REF!)<=10,AVERAGE(#REF!)>=35),\"\",(EXP((-11.4041+(0.0894*AVERAGE(#REF!))+(0.1932*AVERAGE(#REF!)))))/(1+EXP((-11.4041+(0.0894*AVERAGE(#REF!))+(0.1932*AVERAGE(#REF!)))))),\"\"),\"\")","v":""},{"$f":"IF(VLOOKUP($A3,INDIRECT($B3 & \"!$B$10:$P$40\"),14,FALSE)<>\"\",VLOOKUP($A3,INDIRECT($B3 & \"!$B$10:$P$40\"),14,FALSE),\"\")","v":""},{"$f":"IF(VLOOKUP($A3,INDIRECT($B3 & \"!$B$10:$P$40\"),13,FALSE)<>\"\",VLOOKUP($A3,INDIRECT($B3 & \"!$B$10:$P$40\"),13,FALSE),\"\")","v":""},null,"HIDE THESE CELLS->",null,2,1,{"$f":"'Annual Summary'!G$7","v":2023},null,{"$f":"DATE(R3,Q3,P3)","v":"2023-01-02"}]
["2023-01-03","January","","","","","","","",{"$f":"IFERROR(IF((-11.4041+(0.0894*AVERAGE(#REF!))+(0.1932*AVERAGE(#REF!)))<>\"\",IF(OR(AVERAGE(#REF!)<=10,AVERAGE(#REF!)>=35),\"\",(EXP((-11.4041+(0.0894*AVERAGE(#REF!))+(0.1932*AVERAGE(#REF!)))))/(1+EXP((-11.4041+(0.0894*AVERAGE(#REF!))+(0.1932*AVERAGE(#REF!)))))),\"\"),\"\")","v":""},"","",null,null,null,3,1,{"$f":"'Annual Summary'!G$7","v":2023},null,"2023-01-03"]
["2023-01-04","January","","","","","","","",{"$f":"IFERROR(IF((-11.4041+(0.0894*AVERAGE($L1:$L5))+(0.1932*AVERAGE($E1:$F5)))<>\"\",IF(OR(AVERAGE($E1:$F5)<=10,AVERAGE($E1:$F5)>=35),\"\",(EXP((-11.4041+(0.0894*AVERAGE($L1:$L5))+(0.1932*AVERAGE($E1:$F5)))))/(1+EXP((-11.4041+(0.0894*AVERAGE($L1:$L5))+(0.1932*AVERAGE($E1:$F5)))))),\"\"),\"\")","v":""},"","",null,null,null,4,1,{"$f":"'Annual Summary'!G$7","v":2023},null,"2023-01-04"]
["2023-01-05","January","","","","","","","",{"$f":"IFERROR(IF((-11.4041+(0.0894*AVERAGE($L2:$L6))+(0.1932*AVERAGE($E2:$F6)))<>\"\",IF(OR(AVERAGE($E2:$F6)<=10,AVERAGE($E2:$F6)>=35),\"\",(EXP((-11.4041+(0.0894*AVERAGE($L2:$L6))+(0.1932*AVERAGE($E2:$F6)))))/(1+EXP((-11.4041+(0.0894*AVERAGE($L2:$L6))+(0.1932*AVERAGE($E2:$F6)))))),\"\"),\"\")","v":""},"","",null,null,null,5,1,{"$f":"'Annual Summary'!G$7","v":2023},null,"2023-01-05"]
["2023-01-06","January","","","","","","","",{"$f":"IFERROR(IF((-11.4041+(0.0894*AVERAGE($L3:$L7))+(0.1932*AVERAGE($E3:$F7)))<>\"\",IF(OR(AVERAGE($E3:$F7)<=10,AVERAGE($E3:$F7)>=35),\"\",(EXP((-11.4041+(0.0894*AVERAGE($L3:$L7))+(0.1932*AVERAGE($E3:$F7)))))/(1+EXP((-11.4041+(0.0894*AVERAGE($L3:$L7))+(0.1932*AVERAGE($E3:$F7)))))),\"\"),\"\")","v":""},"","",null,null,null,6,1,{"$f":"'Annual Summary'!G$7","v":2023},null,"2023-01-06"]
["2023-01-07","January","","","","","","","","","","",null,null,null,7,1,{"$f":"'Annual Summary'!G$7","v":2023},null,"2023-01-07"]
{"$rows_left_out":359}
{"sheet":"Annual Summary","index":1,"n_rows":24,"n_cols":17,"rows_kept":24,"cut":false,"hidden":false,"merged":[[6,3,6,5],[7,3,7,4],[7,6,7,10]]}
[]
[]
[]
[]
[]
[]
[null,null,null,"ANNUAL SUMMARY - ",null,null,2023]
[null,null,null,"Facility - "]
{"$rows_left_out":17}
{"sheet":"Charts","index":2,"n_rows":0,"n_cols":0,"rows_kept":0,"cut":false,"hidden":false,"merged":[]}

{"sheet":"January","index":3,"n_rows":42,"n_cols":24,"rows_kept":42,"cut":false,"hidden":false,"merged":[[5,5,5,10]]}
[]
[]
[]
[]
[]
[null,null,null,null,null,{"$f":"MID(CELL(\"filename\",A1),FIND(\"]\",CELL(\"filename\",A1))+1,255) & \" \" & 'Annual Summary'!$G$7 & \" Weather Stats\"","v":"January 2023 Weather Stats"}]
[]
[]
{"$rows_left_out":35}
{"sheet":"February","index":4,"n_rows":42,"n_cols":24,"rows_kept":42,"cut":false,"hidden":false,"merged":[[5,5,5,10]]}
[]
[]
[]
[]
[]
[null,null,null,null,null,{"$f":"MID(CELL(\"filename\",A1),FIND(\"]\",CELL(\"filename\",A1))+1,255) & \" \" & 'Annual Summary'!$G$7 & \" Weather Stats\"","v":"February 2023 Weather Stats"}]
[]
[]
{"$rows_left_out":35}
{"sheet":"March","index":5,"n_rows":42,"n_cols":24,"rows_kept":42,"cut":false,"hidden":false,"merged":[[5,5,5,10]]}
[]
[]
[]
[]
[]
[null,null,null,null,null,{"$f":"MID(CELL(\"filename\",A1),FIND(\"]\",CELL(\"filename\",A1))+1,255) & \" \" & 'Annual Summary'!$G$7 & \" Weather Stats\"","v":"March 2023 Weather Stats"}]
[]
[]
{"$rows_left_out":35}
{"sheet":"April","index":6,"n_rows":42,"n_cols":24,"rows_kept":42,"cut":false,"hidden":false,"merged":[[5,5,5,10]]}
[]
[]
[]
[]
[]
[null,null,null,null,null,{"$f":"MID(CELL(\"filename\",A1),FIND(\"]\",CELL(\"filename\",A1))+1,255) & \" \" & 'Annual Summary'!$G$7 & \" Weather Stats\"","v":"April 2023 Weather Stats"}]
[]
[]
{"$rows_left_out":35}
{"sheet":"May","index":7,"n_rows":42,"n_cols":24,"rows_kept":42,"cut":false,"hidden":false,"merged":[[5,5,5,10]]}
[]
[]
[]
[]
[]
[null,null,null,null,null,{"$f":"MID(CELL(\"filename\",A1),FIND(\"]\",CELL(\"filename\",A1))+1,255) & \" \" & 'Annual Summary'!$G$7 & \" Weather Stats\"","v":"May 2023 Weather Stats"}]
[]
[]
{"$rows_left_out":35}
{"sheet":"June","index":8,"n_rows":42,"n_cols":24,"rows_kept":42,"cut":false,"hidden":false,"merged":[[5,5,5,10]]}
[]
[]
[]
[]
[]
[null,null,null,null,null,{"$f":"MID(CELL(\"filename\",A1),FIND(\"]\",CELL(\"filename\",A1))+1,255) & \" \" & 'Annual Summary'!$G$7 & \" Weather Stats\"","v":"June 2023 Weather Stats"}]
[]
[]
{"$rows_left_out":35}
{"sheet":"July","index":9,"n_rows":42,"n_cols":24,"rows_kept":42,"cut":false,"hidden":false,"merged":[[5,5,5,10]]}
[]
[]
[]
[]
[]
[null,null,null,null,null,{"$f":"MID(CELL(\"filename\",A1),FIND(\"]\",CELL(\"filename\",A1))+1,255) & \" \" & 'Annual Summary'!$G$7 & \" Weather Stats\"","v":"July 2023 Weather Stats"}]
[]
[]
{"$rows_left_out":35}
{"sheet":"August","index":10,"n_rows":42,"n_cols":24,"rows_kept":42,"cut":false,"hidden":false,"merged":[[5,5,5,10]]}
[]
[]
[]
[]
[]
[null,null,null,null,null,{"$f":"MID(CELL(\"filename\",A1),FIND(\"]\",CELL(\"filename\",A1))+1,255) & \" \" & 'Annual Summary'!$G$7 & \" Weather Stats\"","v":"August 2023 Weather Stats"}]
[]
[]
{"$rows_left_out":35}
{"sheet":"September","index":11,"n_rows":42,"n_cols":24,"rows_kept":42,"cut":false,"hidden":false,"merged":[[5,5,5,10]]}
[]
[]
[]
[]
[]
[null,null,null,null,null,{"$f":"MID(CELL(\"filename\",A1),FIND(\"]\",CELL(\"filename\",A1))+1,255) & \" \" & 'Annual Summary'!$G$7 & \" Weather Stats\"","v":"September 2023 Weather Stats"}]
[]
[]
{"$rows_left_out":35}
{"sheet":"October","index":12,"n_rows":42,"n_cols":24,"rows_kept":42,"cut":false,"hidden":false,"merged":[[5,5,5,10]]}
[]
[]
[]
[]
[]
[null,null,null,null,null,{"$f":"MID(CELL(\"filename\",A1),FIND(\"]\",CELL(\"filename\",A1))+1,255) & \" \" & 'Annual Summary'!$G$7 & \" Weather Stats\"","v":"October 2023 Weather Stats"}]
[]
[]
{"$rows_left_out":35}
{"sheet":"November","index":13,"n_rows":42,"n_cols":24,"rows_kept":42,"cut":false,"hidden":false,"merged":[[5,5,5,10]]}
[]
[]
[]
[]
[]
[null,null,null,null,null,{"$f":"MID(CELL(\"filename\",A1),FIND(\"]\",CELL(\"filename\",A1))+1,255) & \" \" & 'Annual Summary'!$G$7 & \" Weather Stats\"","v":"November 2023 Weather Stats"}]
[]
[]
{"$rows_left_out":35}
{"sheet":"December","index":14,"n_rows":42,"n_cols":24,"rows_kept":42,"cut":false,"hidden":false,"merged":[[5,5,5,10]]}
[]
[]
[]
[]
[]
[null,null,null,null,null,{"$f":"MID(CELL(\"filename\",A1),FIND(\"]\",CELL(\"filename\",A1))+1,255) & \" \" & 'Annual Summary'!$G$7 & \" Weather Stats\"","v":"December 2023 Weather Stats"}]
[]
[]
{"$rows_left_out":34}